{"text_format":"1","workbook":"xlsx","n_sheets":10,"sheets":["Refrigerant line capacities","717 line capacities","744 transcritical line cap","Refrigerant line detail","744 transcritical line detail","refrigerant list","uom list","available line sizes","refrigerant line types","refrigerant line types CO2"],"not_rendered":{"charts":0,"images":0,"macros":1,"external_links":0,"defined_names":0,"comments":0,"pivot_tables":0},"unopened":[],"bounds":{"document_bytes":16777216,"sheet_cells":100000,"rows_first":2000,"rows_last":500,"rows_between":2000,"halvings":0,"cell_chars":16384,"cell_head_chars":4096},"cells_cut":0,"cells_raw":0,"read":"whole","date_system":"1900"}

{"sheet":"Refrigerant line capacities","index":0,"n_rows":45,"n_cols":24,"rows_kept":45,"cut":false,"hidden":false,"merged":[[0,7,0,12],[0,14,0,19],[1,7,1,12],[1,14,1,19],[3,7,3,12],[3,14,3,19]]}
["UOM",null,"IP","Req'd for",null,null,null,{"$f":"\"Suction line capacity, \"& IF($C$1=\"IP\",\"tons refrigeration\",\"kW\")","v":"Suction line capacity, tons refrigeration"},null,null,null,null,null,null,{"$f":"\"Minimum suction riser line capacity, \"& IF($C$1=\"IP\",\"tons refrigeration\",\"kW\")","v":"Minimum suction riser line capacity, tons refrigeration"},null,null,null,null,null,null,"Discharge","Liquid","Drain"]
[null,null,null,"line types",null,null,null,{"$f":"\"Saturated Suction Temperature, \"& IF($C$1=\"IP\",\"°F\",\"°C\")","v":"Saturated Suction Temperature, °F"},null,null,null,null,null,null,{"$f":"\"Saturated Suction Temperature, \"& IF($C$1=\"IP\",\"°F\",\"°C\")","v":"Saturated Suction Temperature, °F"},null,null,null,null,null,null,{"$f":"\"Line, \"&IF($C$1=\"IP\",\"tons\",\"kW\")","v":"Line, tons"},{"$f":"\"Line, \"&IF($C$1=\"IP\",\"tons\",\"kW\")","v":"Line, tons"},{"$f":"\"Line, \"&IF($C$1=\"IP\",\"tons\",\"kW\")","v":"Line, tons"}]
["Refrigerant",null,{"$f":"VLOOKUP($E$5,'refrigerant list'!A1:B47,2)","v":"448A"},"All",null,null,null,-60,-40,-20,0,20,40,null,-60,-40,-20,0,20,40,null,"refrig","refrig","refrig"]
["Evap Temp",{"$f":"IF($C$1=\"IP\",\"°F\",\"°C\")","v":"°F"},-10,"L, D, CD; S, SR spec'ed in table",null,"Copper Tube",null,{"$f":"\"∆P, \"&IF($C$1=\"IP\",\"psi\",\"bar\")","v":"∆P, psi"},null,null,null,null,null,null,{"$f":"\"Velocity, \"&IF($C$1=\"IP\",\"ft/min\",\"m/s\")","v":"Velocity, ft/min"},null,null,null,null,null,null,{"$f":"\"∆P, \"&IF($C$1=\"IP\",\"psi\",\"bar\")","v":"∆P, psi"},{"$f":"\"∆P, \"&IF($C$1=\"IP\",\"psi\",\"bar\")","v":"∆P, psi"},{"$f":"\"vel, \"&IF($C$1=\"IP\",\"ft/min\",\"m/s\")","v":"vel, ft/min"}]
["Cond Temp",{"$f":"IF($C$1=\"IP\",\"°F\",\"°C\")","v":"°F"},110,"D",25,"OD, in","Type",0.371,0.58899999999999997,0.88500000000000001,1.27,1.75,2.35,null,1200,1200,1200,1200,1200,1200,null,5.74,3.48,100]
["Liquid Temp",{"$f":"IF($C$1=\"IP\",\"°F\",\"°C\")","v":"°F"},100,"All",null,"3/16","ACRA",1.39E-3,2.64E-3,4.64E-3,7.6699999999999997E-3,1.2E-2,1.8100000000000002E-2,null,4.1900000000000001E-3,7.62E-3,1.2999999999999999E-2,2.12E-2,3.3000000000000002E-2,4.9700000000000001E-2,null,5.1400000000000001E-2,0.14199999999999999,0.17899999999999999]
["Superheat",{"$f":"IF($C$1=\"IP\",\"°F\",\"°C\")","v":"°F"},25,"S, SR, D",null,"1/4","ACRA",4.1999999999999997E-3,7.92E-3,1.38E-2,2.2800000000000001E-2,3.56E-2,5.33E-2,null,9.2999999999999992E-3,1.6899999999999998E-2,2.9000000000000001E-2,4.7100000000000003E-2,7.3400000000000007E-2,0.11,null,0.15,0.41799999999999998,0.39900000000000002]
["Equivalent Length",{"$f":"IF($C$1=\"IP\",\"ft\",\"m\")","v":"ft"},100,"All",null,"5/16","ACRA",8.8000000000000005E-3,1.6500000000000001E-2,2.87E-2,4.7100000000000003E-2,7.3400000000000007E-2,0.11,null,1.5900000000000001E-2,2.8899999999999999E-2,4.9500000000000002E-2,8.0500000000000002E-2,0.126,0.189,null,0.307,0.86199999999999999,0.68200000000000005]
["Max Velocity, Suction",{"$f":"IF($C$1=\"IP\",\"ft/min\",\"m/s\")","v":"ft/min"},3000,"S",null,"3/8","ACRA",1.6299999999999999E-2,3.04E-2,5.28E-2,8.6300000000000002E-2,0.13400000000000001,0.2,null,2.4899999999999999E-2,4.53E-2,7.7600000000000002E-2,0.126,0.19700000000000001,0.29599999999999999,null,0.55800000000000005,1.58,1.07]
["Max Velocity, Discharge",{"$f":"IF($C$1=\"IP\",\"ft/min\",\"m/s\")","v":"ft/min"},3000,"D",null,"1/2","ACRA",4.0899999999999999E-2,7.5899999999999995E-2,0.13100000000000001,0.214,0.33200000000000002,0.49399999999999999,null,4.9000000000000002E-2,8.9099999999999999E-2,0.152,0.248,0.38600000000000001,0.58099999999999996,null,1.37,3.89,2.1]
["Max Velocity, Liquid","ft/min",300,"L",null,"5/8","ACRD",7.4800000000000005E-2,0.13900000000000001,0.23899999999999999,0.38900000000000001,0.60199999999999998,0.89500000000000002,null,7.6499999999999999E-2,0.13900000000000001,0.23799999999999999,0.38700000000000001,0.60399999999999998,0.90800000000000003,null,2.4700000000000002,7.05,3.28]
["∆T, Suction",{"$f":"IF($C$1=\"IP\",\"°F\",\"°C\")","v":"°F"},1.5,"S",null,"3/4","ACRD",0.129,0.23799999999999999,0.40899999999999997,0.66400000000000003,1.03,1.52,null,0.114,0.20799999999999999,0.35599999999999998,0.57899999999999996,0.90200000000000002,1.36,null,4.1900000000000004,12,4.9000000000000004]
["∆T, Discharge",{"$f":"IF($C$1=\"IP\",\"°F\",\"°C\")","v":"°F"},1.5,"D",null,"7/8","ACRD",0.2,0.36899999999999999,0.63500000000000001,1.03,1.59,2.36,null,0.159,0.28899999999999998,0.49399999999999999,0.80400000000000005,1.25,1.88,null,6.47,18.600000000000001,6.8]
["∆T, Liquid","°F",1,"L",null,"1-1/8","ACRD",0.41,0.754,1.29,2.09,3.22,4.7699999999999996,null,0.27100000000000002,0.49199999999999999,0.84299999999999997,1.37,2.14,3.21,null,13,34.799999999999997,11.6]
[null,null,null,null,null,"1-3/8","ACRD",0.72,1.32,2.2599999999999998,3.65,5.62,8.31,null,0.41199999999999998,0.75,1.28,2.09,3.25,4.8899999999999997,null,22.7,53,17.7]
{"$rows_left_out":31}
{"sheet":"717 line capacities","index":1,"n_rows":42,"n_cols":24,"rows_kept":42,"cut":false,"hidden":false,"merged":[[1,7,1,12],[3,7,3,12],[0,7,0,12],[0,14,0,19],[1,14,1,19],[3,14,3,19]]}
["UOM",null,"IP","Req'd for",null,null,null,{"$f":"\"Suction line capacity, \"& IF($C$1=\"IP\",\"tons refrigeration\",\"kW\")","v":"Suction line capacity, tons refrigeration"},null,null,null,null,null,null,{"$f":"\"Minimum suction riser line capacity, \"& IF($C$1=\"IP\",\"tons refrigeration\",\"kW\")","v":"Minimum suction riser line capacity, tons refrigeration"},null,null,null,null,null,null,"Discharge","Liquid","Drain"]
[null,null,null,"line types",null,null,null,{"$f":"\"Saturated Suction Temperature, \"& IF($C$1=\"IP\",\"°F\",\"°C\")","v":"Saturated Suction Temperature, °F"},null,null,null,null,null,null,{"$f":"\"Saturated Suction Temperature, \"& IF($C$1=\"IP\",\"°F\",\"°C\")","v":"Saturated Suction Temperature, °F"},null,null,null,null,null,null,{"$f":"\"Line, \"&IF($C$1=\"IP\",\"tons\",\"kW\")","v":"Line, tons"},{"$f":"\"Line, \"&IF($C$1=\"IP\",\"tons\",\"kW\")","v":"Line, tons"},{"$f":"\"Line, \"&IF($C$1=\"IP\",\"tons\",\"kW\")","v":"Line, tons"}]
["Refrigerant",null,"717","All",null,null,null,-60,-40,-20,0,20,40,null,-60,-40,-20,0,20,40,null,"refrig","refrig","refrig"]
["Evap Temp",{"$f":"IF($C$1=\"IP\",\"°F\",\"°C\")","v":"°F"},5,"L, D, CD; S, SR spec'ed in table",null,"Steel Pipe",null,{"$f":"\"∆P, \"&IF($C$1=\"IP\",\"psi\",\"bar\")","v":"∆P, psi"},null,null,null,null,null,null,{"$f":"\"Velocity, \"&IF($C$1=\"IP\",\"ft/min\",\"m/s\")","v":"Velocity, ft/min"},null,null,null,null,null,null,{"$f":"\"∆P, \"&IF($C$1=\"IP\",\"psi\",\"bar\")","v":"∆P, psi"},{"$f":"\"∆P, \"&IF($C$1=\"IP\",\"psi\",\"bar\")","v":"∆P, psi"},{"$f":"\"vel, \"&IF($C$1=\"IP\",\"ft/min\",\"m/s\")","v":"vel, ft/min"}]
["Cond Temp",{"$f":"IF($C$1=\"IP\",\"°F\",\"°C\")","v":"°F"},100,"D",null,"NPS, in","Schedule",0.182,0.30599999999999999,0.48399999999999999,0.72799999999999998,1.05,1.46,null,1200,1200,1200,1200,1200,1200,null,3.3,2.78,100]
["Liquid Temp",{"$f":"IF($C$1=\"IP\",\"°F\",\"°C\")","v":"°F"},86,"All",null,"1/8",80,1.0500000000000001E-2,2.0199999999999999E-2,3.56E-2,5.8799999999999998E-2,9.1499999999999998E-2,0.13600000000000001,null,1.43E-2,2.6200000000000001E-2,4.5100000000000001E-2,7.3599999999999999E-2,0.115,0.17299999999999999,null,0.30299999999999999,2.4,2.27]
["Superheat",{"$f":"IF($C$1=\"IP\",\"°F\",\"°C\")","v":"°F"},25,"S, SR, D",null,"1/4",80,2.7099999999999999E-2,5.16E-2,9.0499999999999997E-2,0.14799999999999999,0.23,0.34,null,2.81E-2,5.16E-2,8.8900000000000007E-2,0.14499999999999999,0.22700000000000001,0.34100000000000003,null,0.754,5.98,4.47]
["Equivalent Length",{"$f":"IF($C$1=\"IP\",\"ft\",\"m\")","v":"ft"},100,"All",null,"3/8",80,6.88E-2,0.13,0.22600000000000001,0.36899999999999999,0.56899999999999995,0.84,null,5.5199999999999999E-2,0.10100000000000001,0.17399999999999999,0.28499999999999998,0.44500000000000001,0.66800000000000004,null,1.86,14.7,8.77]
["Max Velocity, Suction",{"$f":"IF($C$1=\"IP\",\"ft/min\",\"m/s\")","v":"ft/min"},3000,"S",null,"1/2",80,0.13900000000000001,0.26,0.45100000000000001,0.73299999999999998,1.1299999999999999,1.66,null,9.1999999999999998E-2,0.16900000000000001,0.29099999999999998,0.47499999999999998,0.74099999999999999,1.1100000000000001,null,3.67,29.1,14.6]
["Max Velocity, Discharge",{"$f":"IF($C$1=\"IP\",\"ft/min\",\"m/s\")","v":"ft/min"},3000,"D",null,"3/4",80,0.32,0.59699999999999998,1.03,1.67,2.56,3.76,null,0.17,0.312,0.53700000000000003,0.877,1.37,2.06,null,8.2799999999999994,65.7,27]
["Max Velocity, Liquid","ft/min",300,"L",null,"1",80,0.63900000000000001,1.18,2.04,3.29,5.03,7.39,null,0.28299999999999997,0.51800000000000002,0.89300000000000002,1.46,2.2799999999999998,3.42,null,16.2,129,44.9]
["∆T, Suction",{"$f":"IF($C$1=\"IP\",\"°F\",\"°C\")","v":"°F"},1,"S",null,"1-1/4",80,1.26,2.31,3.98,6.5,10.199999999999999,15.3,null,0.504,0.92400000000000004,1.59,2.6,4.0599999999999996,6.1,null,31.9,240,80.099999999999994]
["∆T, Discharge",{"$f":"IF($C$1=\"IP\",\"°F\",\"°C\")","v":"°F"},1,"D",null,"1-1/2",80,1.74,3.18,5.48,8.9600000000000009,14,21,null,0.69399999999999995,1.27,2.19,3.58,5.6,8.4,null,44,331,110]
["∆T, Liquid","°F",1,"L",null,"2",40,3.3,6.04,10.4,17,26.6,39.9,null,1.32,2.42,4.17,6.8,10.6,16,null,83.5,628,209]
[null,null,null,null,null,"2-1/2",40,4.7,8.6199999999999992,14.9,24.3,37.9,56.9,null,1.88,3.45,5.94,9.7100000000000009,15.2,22.8,null,119,896,299]
{"$rows_left_out":28}
{"sheet":"744 transcritical line cap","index":2,"n_rows":45,"n_cols":23,"rows_kept":45,"cut":false,"hidden":false,"merged":[[0,7,0,12],[0,14,0,19],[1,7,1,12],[1,14,1,19],[3,7,3,12],[3,14,3,19]]}
["UOM",null,"IP","Req'd for",null,null,null,{"$f":"\"Suction line capacity, \"& IF($C$1=\"IP\",\"tons refrigeration\",\"kW\")","v":"Suction line capacity, tons refrigeration"},null,null,null,null,null,null,{"$f":"\"Minimum suction riser line capacity, \"& IF($C$1=\"IP\",\"tons refrigeration\",\"kW\")","v":"Minimum suction riser line capacity, tons refrigeration"},null,null,null,null,null,null,"Discharge","Gas"]
[null,null,null,"line types",null,null,null,{"$f":"\"Saturated Suction Temperature, \"& IF($C$1=\"IP\",\"°F\",\"°C\")","v":"Saturated Suction Temperature, °F"},null,null,null,null,null,null,{"$f":"\"Saturated Suction Temperature, \"& IF($C$1=\"IP\",\"°F\",\"°C\")","v":"Saturated Suction Temperature, °F"},null,null,null,null,null,null,{"$f":"\"Line, \"&IF($C$1=\"IP\",\"tons\",\"kW\")","v":"Line, tons"},{"$f":"\"Line, \"&IF($C$1=\"IP\",\"tons\",\"kW\")","v":"Line, tons"}]
["Refrigerant",null,"744","All",null,null,null,-60,-40,-20,0,20,40,null,-60,-40,-20,0,20,40,null,"refrig","refrig"]
["Evap Temp",{"$f":"IF($C$1=\"IP\",\"°F\",\"°C\")","v":"°F"},0,"G, D; S, SR spec'ed in table",null,"Copper Tube",null,{"$f":"\"∆P, \"&IF($C$1=\"IP\",\"psi\",\"bar\")","v":"∆P, psi"},null,null,null,null,null,null,{"$f":"\"Velocity, \"&IF($C$1=\"IP\",\"ft/min\",\"m/s\")","v":"Velocity, ft/min"},null,null,null,null,null,null,{"$f":"\"∆P, \"&IF($C$1=\"IP\",\"psi\",\"bar\")","v":"∆P, psi"},{"$f":"\"∆P, \"&IF($C$1=\"IP\",\"psi\",\"bar\")","v":"∆P, psi"}]
["Gas Cooler Press",{"$f":"IF($C$1=\"IP\",\"psig\",\"bar(g)\")","v":"psig"},1400,"All",null,"OD, in","Type",0.53900000000000003,0.74399999999999999,0.99099999999999999,1.28,1.62,2.02,null,1200,1200,1200,1200,1200,1200,null,3.44,3.44]
["Gas Cooler Outlet Temp",{"$f":"IF($C$1=\"IP\",\"°F\",\"°C\")","v":"°F"},120,"All",null,"3/16","ACRA",1.91E-3,3.0899999999999999E-3,4.64E-3,6.4900000000000001E-3,8.3999999999999995E-3,9.7999999999999997E-3,null,0.01,1.6199999999999999E-2,2.4299999999999999E-2,3.4299999999999997E-2,4.5100000000000001E-2,5.3699999999999998E-2,null,1.8599999999999998E-2,2.7400000000000001E-2]
["Superheat",{"$f":"IF($C$1=\"IP\",\"°F\",\"°C\")","v":"°F"},40,"S, SR, D",null,"1/4","ACRA",5.7000000000000002E-3,9.1800000000000007E-3,1.37E-2,1.9099999999999999E-2,2.47E-2,2.87E-2,null,2.23E-2,3.5900000000000001E-2,5.3999999999999999E-2,7.6200000000000004E-2,0.1,0.11899999999999999,null,5.4199999999999998E-2,0.08]
["Equivalent Length",{"$f":"IF($C$1=\"IP\",\"ft\",\"m\")","v":"ft"},100,"All",null,"5/16","ACRA",1.18E-2,1.9E-2,2.8299999999999999E-2,3.9399999999999998E-2,5.0700000000000002E-2,5.8999999999999997E-2,null,3.8199999999999998E-2,6.1400000000000003E-2,9.2399999999999996E-2,0.13,0.17100000000000001,0.20399999999999999,null,0.111,0.16400000000000001]
["Max Velocity, Suction",{"$f":"IF($C$1=\"IP\",\"ft/min\",\"m/s\")","v":"ft/min"},3000,"S",null,"3/8","194(1885)",2.3300000000000001E-2,3.73E-2,5.5500000000000001E-2,7.6999999999999999E-2,9.9000000000000005E-2,0.115,null,6.2899999999999998E-2,0.10100000000000001,0.152,0.215,0.28199999999999997,0.33600000000000002,null,0.216,0.318]
["Max Velocity, Discharge",{"$f":"IF($C$1=\"IP\",\"ft/min\",\"m/s\")","v":"ft/min"},3000,"D",null,"1/2","194(1885)",5.0799999999999998E-2,8.1199999999999994E-2,0.121,0.16700000000000001,0.214,0.248,null,0.112,0.18,0.27200000000000002,0.38300000000000001,0.504,0.6,null,0.46600000000000003,0.625]
["Max Velocity, Gas","ft/min",300,"G",null,"5/8","194(1885)",9.3799999999999994E-2,0.14899999999999999,0.221,0.30599999999999999,0.39300000000000002,0.45400000000000001,null,0.17699999999999999,0.28499999999999998,0.42799999999999999,0.60399999999999998,0.79500000000000004,0.94599999999999995,null,0.85199999999999998,0.98599999999999999]
["∆T, Suction",{"$f":"IF($C$1=\"IP\",\"°F\",\"°C\")","v":"°F"},0.25,"S",null,"3/4","194(1885)",0.153,0.24299999999999999,0.36,0.497,0.63700000000000001,0.73699999999999999,null,0.255,0.41,0.61699999999999999,0.87,1.1399999999999999,1.36,null,1.38,1.42]
["∆T, Discharge",{"$f":"IF($C$1=\"IP\",\"°F\",\"°C\")","v":"°F"},0.25,"D",null,"7/8","194(1885)",0.23100000000000001,0.36699999999999999,0.54300000000000004,0.749,0.95899999999999996,1.1100000000000001,null,0.34699999999999998,0.55800000000000005,0.84,1.18,1.56,1.85,null,2.0699999999999998,1.93]
["∆T, Gas","°F",0.25,"G",null,"1-1/8","194(1885)",0.45600000000000002,0.72399999999999998,1.07,1.47,1.88,2.17,null,0.57799999999999996,0.93,1.4,1.97,2.6,3.09,null,4.0599999999999996,3.22]
[null,null,null,null,null,"1-3/8","194(1885)",0.77700000000000002,1.23,1.81,2.5,3.19,3.68,null,0.86199999999999999,1.39,2.09,2.95,3.87,4.6100000000000003,null,6.87,4.8]
{"$rows_left_out":31}
{"sheet":"Refrigerant line detail","index":3,"n_rows":43,"n_cols":16,"rows_kept":43,"cut":false,"hidden":false,"merged":[]}
["UOM",null,"IP","Req'd for",null,null,null,null,null,null,null,null,"Darcy"]
["Refrigerant Line Type",null,"Discharge","line types",null,"Copper Tube",null,null,"Capacity","Mass Flow","Velocity","Reynold's","Friction","Relative","∆P","∆T"]
["Refrigerant",null,{"$f":"VLOOKUP($E$3,'refrigerant list'!A1:B47,2)","v":"449A"},"All",26,"OD, in","Type","ID, in",{"$f":"IF($C$1=\"IP\",\"tons\",\"kW\")","v":"tons"},{"$f":"IF($C$1=\"IP\",\"lbm/min\",\"kg/s\")","v":"lbm/min"},{"$f":"IF($C$1=\"IP\",\"ft/min\",\"m/s\")","v":"ft/min"},"Number","Factor","Roughness",{"$f":"IF($C$1=\"IP\",\"psi\",\"bar\")","v":"psi"},{"$f":"IF($C$1=\"IP\",\"°F\",\"°C\")","v":"°F"}]
["Evap Temp",{"$f":"IF($C$1=\"IP\",\"°F\",\"°C\")","v":"°F"},-40,"All",null,"3/16","ACRA",0.1275,2.81E-2,0.1134,356,20250,2.681E-2,4.706E-4,3.44,1]
["Cond Temp",{"$f":"IF($C$1=\"IP\",\"°F\",\"°C\")","v":"°F"},105,"D",null,"1/4","ACRA",0.19,8.2299999999999998E-2,0.33229999999999998,470,39810,2.2960000000000001E-2,3.1579999999999998E-4,3.44,1]
["Liquid Temp",{"$f":"IF($C$1=\"IP\",\"°F\",\"°C\")","v":"°F"},105,"All",null,"5/16","ACRA",0.2485,0.16900000000000001,0.68240000000000001,564,62510,2.0830000000000001E-2,2.4140000000000001E-4,3.44,1]
["Suction Vapor Temp",{"$f":"IF($C$1=\"IP\",\"°F\",\"°C\")","v":"°F"},-15,"S, SR, D",null,"3/8","ACRA",0.311,0.308,1.2430000000000001,655,90970,1.9279999999999999E-2,1.929E-4,3.44,1]
["Equivalent Length",{"$f":"IF($C$1=\"IP\",\"ft\",\"m\")","v":"ft"},100,"All",null,"1/2","ACRA",0.436,0.75700000000000001,3.056,820,159600,1.7270000000000001E-2,1.3760000000000001E-4,3.44,1]
["Maximum Velocity",{"$f":"IF($C$1=\"IP\",\"ft/min\",\"m/s\")","v":"ft/min"},3000,"SR, CD; optional for L, S, D",null,"5/8","ACRD",0.54500000000000004,1.37,5.5259999999999998,949,230800,1.6119999999999999E-2,1.1010000000000001E-4,3.44,1]
["Rating, ∆T",{"$f":"IF($C$1=\"IP\",\"°F\",\"°C\")","v":"°F"},1,"L, S, D",null,"3/4","ACRD",0.66600000000000004,2.33,9.3979999999999997,1080,321200,1.519E-2,9.009E-5,3.44,1]
[null,null,null,null,null,"7/8","ACRD",0.78500000000000003,3.59,14.51,1200,420900,1.4489999999999999E-2,7.6429999999999998E-5,3.44,1]
["Effective Roughness",null,null,null,null,"1-1/8","ACRD",1.0249999999999999,7.27,29.34,1420,651500,1.346E-2,5.8539999999999999E-5,3.44,1]
["Copper Tube",{"$f":"IF($C$1=\"IP\",\"ft\",\"m\")","v":"ft"},{"$f":"IF($C$1=\"IP\",\"5.0E-6\",\"1.524E-6\")","v":"5.0E-6"},null,null,"1-3/8","ACRD",1.2649999999999999,12.6,51.04,1630,918500,1.273E-2,4.7429999999999998E-5,3.44,1]
["Steel Pipe",{"$f":"IF($C$1=\"IP\",\"ft\",\"m\")","v":"ft"},{"$f":"IF($C$1=\"IP\",\"1.5E-4\",\"4.572E-5\")","v":"1.5E-4"},null,null,"1-5/8","ACRD",1.5049999999999999,20,80.58,1810,1219000,1.217E-2,3.9870000000000003E-5,3.44,1]
[null,null,null,null,null,"2-1/8","ACRD",1.9850000000000001,41.3,166.6,2160,1910000,1.137E-2,3.023E-5,3.44,1]
{"$rows_left_out":29}
{"sheet":"744 transcritical line detail","index":4,"n_rows":43,"n_cols":16,"rows_kept":43,"cut":false,"hidden":false,"merged":[]}
["UOM",null,"IP","Req'd for",null,null,null,null,null,null,null,null,"Darcy"]
["Refrigerant Line Type",null,"Discharge","line types",null,"Copper Tube",null,null,"Capacity","Mass Flow","Velocity","Reynold's","Friction","Relative","∆P","∆T"]
["Refrigerant",null,"744",null,null,"OD, in","Type","ID, in",{"$f":"IF($C$1=\"IP\",\"tons\",\"kW\")","v":"tons"},{"$f":"IF($C$1=\"IP\",\"lbm/min\",\"kg/s\")","v":"lbm/min"},{"$f":"IF($C$1=\"IP\",\"ft/min\",\"m/s\")","v":"ft/min"},"Number","Factor","Roughness",{"$f":"IF($C$1=\"IP\",\"psi\",\"bar\")","v":"psi"},{"$f":"IF($C$1=\"IP\",\"°F\",\"°C\")","v":"°F"}]
["Evap Temp",{"$f":"IF($C$1=\"IP\",\"°F\",\"°C\")","v":"°F"},0,"All",null,"3/16","ACRA",0.1275,4.58E-2,0.22739999999999999,266,30120,2.469E-2,4.706E-4,4.75,0.25]
["Gas Cooler Press",{"$f":"IF($C$1=\"IP\",\"psig\",\"bar(g)\")","v":"psig"},1400,"All",null,"1/4","ACRA",0.19,0.13400000000000001,0.6633,349,58960,2.1319999999999999E-2,3.1579999999999998E-4,4.75,0.25]
["Gas Cooler Outlet Temp",{"$f":"IF($C$1=\"IP\",\"°F\",\"°C\")","v":"°F"},110,"All",null,"5/16","ACRA",0.2485,0.27300000000000002,1.359,418,92330,1.9449999999999999E-2,2.4140000000000001E-4,4.75,0.25]
["Suction Vapor Temp",{"$f":"IF($C$1=\"IP\",\"°F\",\"°C\")","v":"°F"},40,"S, SR, D",null,"3/8","194(1885)",0.31900000000000001,0.53200000000000003,2.6419999999999999,494,139900,1.7940000000000001E-2,1.8809999999999999E-4,4.75,0.25]
["Equivalent Length",{"$f":"IF($C$1=\"IP\",\"ft\",\"m\")","v":"ft"},100,"All",null,"1/2","194(1885)",0.42599999999999999,1.1499999999999999,5.6920000000000002,596,225700,1.6400000000000001E-2,1.4080000000000001E-4,4.75,0.25]
["Maximum Velocity",{"$f":"IF($C$1=\"IP\",\"ft/min\",\"m/s\")","v":"ft/min"},3000,"SR; optional for G, S, D",null,"5/8","194(1885)",0.53500000000000003,2.09,10.4,691,328400,1.5339999999999999E-2,1.121E-4,4.75,0.25]
["Rating, ∆T",{"$f":"IF($C$1=\"IP\",\"°F\",\"°C\")","v":"°F"},0.25,"G, S, D",null,"3/4","194(1885)",0.64200000000000002,3.39,16.84,777,443000,1.457E-2,9.3460000000000003E-5,4.75,0.25]
[null,null,null,null,null,"7/8","194(1885)",0.749,5.09,25.28,857,570100,1.397E-2,8.0110000000000004E-5,4.75,0.25]
["Effective Roughness",null,null,null,null,"1-1/8","194(1885)",0.96699999999999997,10,49.53,1010,865100,1.306E-2,6.2050000000000004E-5,4.75,0.25]
["Copper Tube",{"$f":"IF($C$1=\"IP\",\"ft\",\"m\")","v":"ft"},{"$f":"IF($C$1=\"IP\",\"5.0E-6\",\"1.524E-6\")","v":"5.0E-6"},null,null,"1-3/8","194(1885)",1.181,16.899999999999999,83.74,1140,1198000,1.2409999999999999E-2,5.0800000000000002E-5,4.75,0.25]
["Steel Pipe",{"$f":"IF($C$1=\"IP\",\"ft\",\"m\")","v":"ft"},{"$f":"IF($C$1=\"IP\",\"1.5E-4\",\"4.572E-5\")","v":"1.5E-4"},null,null,"1-5/8","194(1885)",1.395,26.1,129.6,1270,1569000,1.191E-2,4.3010000000000003E-5,4.75,0.25]
[null,null,null,null,null,"2-1/8","194(1885)",1.825,52.7,261.89999999999998,1500,2424000,1.1180000000000001E-2,3.2879999999999997E-5,4.75,0.25]
{"$rows_left_out":29}
{"sheet":"refrigerant list","index":5,"n_rows":47,"n_cols":2,"rows_kept":47,"cut":false,"hidden":false,"merged":[]}
[1,"12"]
[2,"134a"]
[3,"22"]
[4,"245fa"]
[5,"290"]
[6,"32"]
[7,"401A"]
[8,"402A"]
[9,"404A"]
[10,"407A"]
[11,"407C"]
[12,"407F"]
[13,"407H"]
[14,"408A"]
[15,"409A"]
{"$rows_left_out":33}
{"sheet":"uom list","index":6,"n_rows":2,"n_cols":1,"rows_kept":2,"cut":false,"hidden":false,"merged":[]}
["IP"]
["SI"]

{"sheet":"available line sizes","index":7,"n_rows":150,"n_cols":3,"rows_kept":150,"cut":false,"hidden":false,"merged":[]}
["Copper tube"]
[]
["Tube OD","Type","Tube ID"]
["1/8","ACRA",6.5000000000000002E-2]
["3/16","ACRA",0.1275]
["1/4","ACRA",0.19]
["5/16","ACRA",0.2485]
["3/8","ACRA",0.311]
["1/2","ACRA",0.436]
["5/8","ACRA",0.55500000000000005]
["3/4","ACRA",0.68]
["7/8","ACRA",0.78500000000000003]
["1-1/8","ACRA",1.0249999999999999]
["1-3/8","ACRA",1.2649999999999999]
["1-5/8","ACRA",1.5049999999999999]
{"$rows_left_out":136}
{"sheet":"refrigerant line types","index":8,"n_rows":5,"n_cols":1,"rows_kept":5,"cut":false,"hidden":false,"merged":[]}
["Liquid"]
["Suction"]
["Suction Riser"]
["Discharge"]
["Condenser Drain"]

{"sheet":"refrigerant line types CO2","index":9,"n_rows":4,"n_cols":1,"rows_kept":4,"cut":false,"hidden":false,"merged":[]}
["Gas"]
["Suction"]
["Suction Riser"]
["Discharge"]